BDBM486316 US10947210, Compound 25-4
SMILES CCOC(=O)C(OCCOCCOCCN(c1cc2oc(c(C(=O)NC)c2cc1C1CC1)-c1ccc(F)cc1)S(C)(=O)=O)c1ccccc1
InChI Key InChIKey=YQTYYOURJWLPKR-UHFFFAOYSA-N
Data  1 IC50
  Tab Delimited (TSV)   2D SDfile   Computed 3D by Vconf -m prep SDfile
Find this compound or compounds like it in BindingDB:
Activity Spreadsheet -- Enzyme Inhibition Constant Data from BindingDB
Found 1 hit for monomerid = 486316
TargetGenome polyprotein(Hepatitis C virus genotype 3a (isolate k3a) (HCV))
Cocrystal Pharma
US Patent
LigandPNGBDBM486316(US10947210, Compound 25-4)
Affinity DataIC50: >1.00E+3nM. Assay description: The reaction mixtures consisted of 50 mM Hepes-KOH, pH 7.5, 5 mM MgCl2, 5 mM DTT, 2% glycerol, 0.01% Triton® X-100, 0.5 uM polyA:U16 substrate, purif...
Ligand InfoPC cidPC sid
In DepthDetails US Patent