BDBM486349 US10947210, Compound 30-14
SMILES CCOC(=O)c1cc(COCCOCCN(c2cc3oc(c(C(=O)NC)c3cc2C2CC2)-c2ccc(F)cc2)S(C)(=O)=O)ccc1F
InChI Key InChIKey=KJSPVVDSCWOGLH-UHFFFAOYSA-N
Data  1 IC50
  Tab Delimited (TSV)   2D SDfile   Computed 3D by Vconf -m prep SDfile
Find this compound or compounds like it in BindingDB:
Activity Spreadsheet -- Enzyme Inhibition Constant Data from BindingDB
Found 1 hit for monomerid = 486349
TargetGenome polyprotein(Hepatitis C virus genotype 3a (isolate k3a) (HCV))
Cocrystal Pharma
US Patent
LigandPNGBDBM486349(US10947210, Compound 30-14)
Affinity DataIC50: >1.00E+3nM. Assay description: The reaction mixtures consisted of 50 mM Hepes-KOH, pH 7.5, 5 mM MgCl2, 5 mM DTT, 2% glycerol, 0.01% Triton® X-100, 0.5 uM polyA:U16 substrate, purif...
Ligand InfoPC cidPC sid
In DepthDetails US Patent