BDBM48646 4-Ethyl-1-mercapto-7,8-dihydro-4H,6H-9-thia-2,3,4,9b-tetraaza-cyclopenta[b]-as-indacen-5-one::MLS000552199::SMR000145913::cid_913030
SMILES CCn1c2n[nH]c(=S)n2c2sc3CCCc3c2c1=O
InChI Key InChIKey=YDWIJABLXKWZDC-UHFFFAOYSA-N
Data  3 IC50
  Tab Delimited (TSV)   2D SDfile   Computed 3D by Vconf -m prep SDfile
Find this compound or compounds like it in BindingDB:
Activity Spreadsheet -- Enzyme Inhibition Constant Data from BindingDB
Found 3 hits for monomerid = 48646
TargetEukaryotic translation initiation factor 4 gamma 1(Homo sapiens (Human))
Emory University
Curated by PubChem BioAssay
LigandPNGBDBM48646(4-Ethyl-1-mercapto-7,8-dihydro-4H,6H-9-thia-2,3,4,...)
Affinity DataIC50:  6.40E+4nM. Assay description: Dose Response Confirmation for Small Molecule Inhibitors of Eukaryotic Translation Initiation NIH Molecular Libraries Screening Centers Network [MLSC...
In DepthDetails PCBioAssay
TargetDNA dC->dU-editing enzyme APOBEC-3A(Homo sapiens (Human))
Burnham Center For Chemical Genomics
Curated by PubChem BioAssay
LigandPNGBDBM48646(4-Ethyl-1-mercapto-7,8-dihydro-4H,6H-9-thia-2,3,4,...)
Affinity DataIC50: >1.00E+5nMT: 2°C. Assay description: Data Source: Sanford-Burnham Center for Chemical Genomics (SBCCG) Source Affiliation: Sanford-Burnham Medical Research Institute (SBMRI, San Diego, C...
In DepthDetails PCBioAssay
TargetDNA dC->dU-editing enzyme APOBEC-3G(Homo sapiens (Human))
Burnham Center For Chemical Genomics
Curated by PubChem BioAssay
LigandPNGBDBM48646(4-Ethyl-1-mercapto-7,8-dihydro-4H,6H-9-thia-2,3,4,...)
Affinity DataIC50:  4.78E+3nMT: 2°C. Assay description: Data Source: Sanford-Burnham Center for Chemical Genomics (SBCCG) Source Affiliation: Sanford-Burnham Medical Research Institute (SBMRI, San Diego, C...
In DepthDetails PCBioAssay