BDBM486475 US10947226, Example 21
SMILES CCn1cc2CC[C@@H](NC(=O)c3ncn(Cc4ccccc4F)n3)C(=O)N(C)c2cc1=O
InChI Key InChIKey=YOIYAFDZPJGKSA-QGZVFWFLSA-N
Data  1 KI
  Tab Delimited (TSV)   2D SDfile   Computed 3D by Vconf -m prep SDfile
Find this compound or compounds like it in BindingDB:
Activity Spreadsheet -- Enzyme Inhibition Constant Data from BindingDB
Found 1 hit for monomerid = 486475
TargetReceptor-interacting serine/threonine-protein kinase 1(Homo sapiens (Human))
Genentech
US Patent
LigandPNGBDBM486475(US10947226, Example 21)
Affinity DataKi: >1.00E+4nM. Assay description: Enzyme assay: The ability of the receptor interacting protein kinase (RIPK1) to catalyze the hydrolysis of adenosine-5′-triphosphate (ATP) is m...
Ligand InfoPC cidPC sid
In DepthDetails US Patent