BDBM486564 US10947251, Example 36
SMILES [H][C@@]12CCC(=O)N(c3cc(F)c(cc3OC)-c3cccc(c3)C(F)(F)F)[C@]1([H])CCN(C2)S(=O)(=O)Nc1ccon1
InChI Key InChIKey=HITXLUTUQDNCFV-OXJNMPFZSA-N
Data  2 IC50
  Tab Delimited (TSV)   2D SDfile   Computed 3D by Vconf -m prep SDfile
Find this compound or compounds like it in BindingDB:
Activity Spreadsheet -- Enzyme Inhibition Constant Data from BindingDB
Found 2 hits for monomerid = 486564
TargetSodium channel protein type 9 subunit alpha(Homo sapiens (Human))
Genentech
US Patent
LigandPNGBDBM486564(US10947251, Example 36)
Affinity DataIC50:  2.19nM. Assay description: Patch voltage clamp electrophysiology allows for the direct measurement and quantification of block of voltage-gated sodium channels (NaV's), and...
Ligand InfoPC cidPC sid
In DepthDetails US Patent
TargetSodium channel protein type 9 subunit alpha(Homo sapiens (Human))
Genentech
US Patent
LigandPNGBDBM486564(US10947251, Example 36)
Affinity DataIC50:  20.7nM. Assay description: Heterologously Express hNav1.7 and the β1 SubunitPreparation of membranes containing recombinantly expressed sodium channels: Frozen recombinant...
Ligand InfoPC cidPC sid
In DepthDetails US Patent