BDBM487495 US10954193, Example 40
SMILES Cc1cc(OCCCc2cn(CCC(=O)NS(=O)(=O)c3ccc(Oc4ccccc4)cc3)c3cc(Cl)ccc23)cc(C)c1Cl
InChI Key InChIKey=WIMAYWRWELWNDH-UHFFFAOYSA-N
Data  1 IC50
  Tab Delimited (TSV)   2D SDfile   Computed 3D by Vconf -m prep SDfile
Find this compound or compounds like it in BindingDB:
Activity Spreadsheet -- Enzyme Inhibition Constant Data from BindingDB
Found 1 hit for monomerid = 487495
TargetInduced myeloid leukemia cell differentiation protein Mcl-1(Homo sapiens (Human))
Vanderbilt University
US Patent
LigandPNGBDBM487495(US10954193, Example 40)
Affinity DataIC50:  400nM. Assay description: Compound affinity was measured using a fluorescence polarization anisotropy competition assay. Anisotropy measurements were carried out in 384-well, ...
Ligand InfoPC cidPC sid
In DepthDetails US Patent