BDBM487555 US10954193, Example 100
SMILES Cc1n[nH]c(C)c1-c1cccc2c(CCCOc3cc(C)c(Cl)c(C)c3)c(C)n(Cc3cccc(c3)C(O)=O)c12
InChI Key InChIKey=XNUGGGNUKPIEGI-UHFFFAOYSA-N
Data  3 KI  1 IC50
  Tab Delimited (TSV)   2D SDfile   Computed 3D by Vconf -m prep SDfile
Find this compound or compounds like it in BindingDB:
Activity Spreadsheet -- Enzyme Inhibition Constant Data from BindingDB
Found 4 hits for monomerid = 487555
TargetInduced myeloid leukemia cell differentiation protein Mcl-1(Homo sapiens (Human))
Vanderbilt University
US Patent
LigandPNGBDBM487555(US10954193, Example 100)
Affinity DataKi:  10nM. Assay description: Compound affinity was measured using a fluorescence polarization anisotropy competition assay. Anisotropy measurements were carried out in 384-well, ...
Ligand InfoPC cidPC sid
In DepthDetails US Patent
TargetApoptosis regulator Bcl-2(Homo sapiens (Human))
Vanderbilt University
US Patent
LigandPNGBDBM487555(US10954193, Example 100)
Affinity DataKi:  1.20E+3nM. Assay description: Compound affinity was measured using a fluorescence polarization anisotropy competition assay. Anisotropy measurements were carried out in 384-well, ...
Ligand InfoPC cidPC sid
In DepthDetails US Patent
TargetBcl-2-like protein 1(Homo sapiens (Human))
Vanderbilt University
US Patent
LigandPNGBDBM487555(US10954193, Example 100)
Affinity DataKi:  4.70E+3nM. Assay description: Compound affinity was measured using a fluorescence polarization anisotropy competition assay. Anisotropy measurements were carried out in 384-well, ...
Ligand InfoPC cidPC sid
In DepthDetails US Patent
TargetInduced myeloid leukemia cell differentiation protein Mcl-1(Homo sapiens (Human))
Vanderbilt University
US Patent
LigandPNGBDBM487555(US10954193, Example 100)
Affinity DataIC50: <100nM. Assay description: Compound affinity was measured using a fluorescence polarization anisotropy competition assay. Anisotropy measurements were carried out in 384-well, ...
Ligand InfoPC cidPC sid
In DepthDetails US Patent