BDBM488407 2-[4-Amino-7-(propan-2-yl)pyrrolo[2,1- f][1,2,4]triazin-5-yl]-N-methyl-1H-indole-6- carboxamide::US10954241, Example 47::US11548896, Example 47
SMILES CNC(=O)c1ccc2cc([nH]c2c1)-c1cc(C(C)C)n2ncnc(N)c12
InChI Key InChIKey=HUZSXLDCKIDHRU-UHFFFAOYSA-N
Data  6 IC50
  Tab Delimited (TSV)   2D SDfile   Computed 3D by Vconf -m prep SDfile
Find this compound or compounds like it in BindingDB:
Activity Spreadsheet -- Enzyme Inhibition Constant Data from BindingDB
Found 6 hits for monomerid = 488407
TargetProto-oncogene tyrosine-protein kinase receptor Ret(Homo sapiens (Human))
Cancer Research Technology
US Patent
LigandPNGBDBM488407(2-[4-Amino-7-(propan-2-yl)pyrrolo[2,1- f][1,2,4]tr...)
Affinity DataIC50:  4.84nM. Assay description: Kinase activity was detected using CisBio HTRF kinEASE kit based on time-resolved fluorescence transfer (FRET). The assay was performed in 384-well w...
Ligand InfoPC cidPC sid
In DepthDetails US Patent
TargetVascular endothelial growth factor receptor 2(Homo sapiens (Human))
Cancer Research Technology
US Patent
LigandPNGBDBM488407(2-[4-Amino-7-(propan-2-yl)pyrrolo[2,1- f][1,2,4]tr...)
Affinity DataIC50:  2.56E+3nM. Assay description: Kinase activity was detected using CisBio HTRF kinEASE kit based on time-resolved fluorescence transfer (FRET). The assay was performed in 384-well w...
Ligand InfoPC cidPC sid
In DepthDetails US Patent
TargetProto-oncogene tyrosine-protein kinase receptor Ret [V804M](Homo sapiens (Human))
Cancer Research Technology
US Patent
LigandPNGBDBM488407(2-[4-Amino-7-(propan-2-yl)pyrrolo[2,1- f][1,2,4]tr...)
Affinity DataIC50:  494nM. Assay description: RET, RETV804M and KDR: Kinase activity was detected using CisBio HTRF kinEASE kit based on time-resolved fluorescence transfer (FRET). The assay was ...
Ligand InfoPC cidPC sid
In DepthDetails US Patent
TargetProto-oncogene tyrosine-protein kinase receptor Ret(Homo sapiens (Human))
Cancer Research Technology
US Patent
LigandPNGBDBM488407(2-[4-Amino-7-(propan-2-yl)pyrrolo[2,1- f][1,2,4]tr...)
Affinity DataIC50:  4.84nM. Assay description: RET, RETV804M and KDR: Kinase activity was detected using CisBio HTRF kinEASE kit based on time-resolved fluorescence transfer (FRET). The assay was ...
Ligand InfoPC cidPC sid
In DepthDetails US Patent
TargetVascular endothelial growth factor receptor 2(Homo sapiens (Human))
Cancer Research Technology
US Patent
LigandPNGBDBM488407(2-[4-Amino-7-(propan-2-yl)pyrrolo[2,1- f][1,2,4]tr...)
Affinity DataIC50:  2.56E+3nM. Assay description: RET, RETV804M and KDR: Kinase activity was detected using CisBio HTRF kinEASE kit based on time-resolved fluorescence transfer (FRET). The assay was ...
Ligand InfoPC cidPC sid
In DepthDetails US Patent
TargetProto-oncogene tyrosine-protein kinase receptor Ret [V804M](Homo sapiens (Human))
Cancer Research Technology
US Patent
LigandPNGBDBM488407(2-[4-Amino-7-(propan-2-yl)pyrrolo[2,1- f][1,2,4]tr...)
Affinity DataIC50:  494nM. Assay description: Kinase activity was detected using CisBio HTRF kinEASE kit based on time-resolved fluorescence transfer (FRET). The assay was performed in 384-well w...
Ligand InfoPC cidPC sid
In DepthDetails US Patent