BDBM48942 MLS000093169::N-(1,3-benzodioxol-5-yl)-3-(1-ethyl-5-methyl-4-pyrazolyl)-4,5-dihydroisoxazole-5-carboxamide::N-(1,3-benzodioxol-5-yl)-3-(1-ethyl-5-methyl-pyrazol-4-yl)-2-isoxazoline-5-carboxamide::N-(1,3-benzodioxol-5-yl)-3-(1-ethyl-5-methyl-pyrazol-4-yl)-4,5-dihydro-1,2-oxazole-5-carboxamide::N-(1,3-benzodioxol-5-yl)-3-(1-ethyl-5-methylpyrazol-4-yl)-4,5-dihydro-1,2-oxazole-5-carboxamide::N-1,3-benzodioxol-5-yl-3-(1-ethyl-5-methyl-1H-pyrazol-4-yl)-4,5-dihydroisoxazole-5-carboxamide::SMR000028797::cid_3237410
SMILES CCn1ncc(C2=NOC(C2)C(=O)Nc2ccc3OCOc3c2)c1C
InChI Key InChIKey=DURVLQNUNLKPFW-UHFFFAOYSA-N
Data  1 EC50
  Tab Delimited (TSV)   2D SDfile   Computed 3D by Vconf -m prep SDfile
Find this compound or compounds like it in BindingDB:
Activity Spreadsheet -- Enzyme Inhibition Constant Data from BindingDB
Found 1 hit for monomerid = 48942
TargetD(1B) dopamine receptor(Homo sapiens (Human))
Vanderbilt Screening Center For Gpcrs, Ion Channels And Transporters
Curated by PubChem BioAssay
LigandPNGBDBM48942(MLS000093169 | N-(1,3-benzodioxol-5-yl)-3-(1-ethyl...)
Affinity DataEC50:  0.0189nM. Assay description: Assay Provider: Val Watts Assay Provider Affiliation: Purdue University Grant Title: Allosteric Modulators of D1 Receptors Grant Number: 1 X01 MH0776...
In DepthDetails PCBioAssay