BDBM48972 4-[7-[(2-fluorophenyl)methyl]-1,3-dimethyl-2,6-bis(oxidanylidene)purin-8-yl]sulfanylbutanenitrile::4-[7-[(2-fluorophenyl)methyl]-1,3-dimethyl-2,6-dioxopurin-8-yl]sulfanylbutanenitrile::4-[[7-(2-fluorobenzyl)-2,6-diketo-1,3-dimethyl-purin-8-yl]thio]butyronitrile::4-[[7-[(2-fluorophenyl)methyl]-1,3-dimethyl-2,6-dioxo-8-purinyl]thio]butanenitrile::MLS000115882::SMR000092889::cid_3152491
SMILES Cn1c2nc(SCCCC#N)n(Cc3ccccc3F)c2c(=O)n(C)c1=O
InChI Key InChIKey=GSDIPVFJRICBLL-UHFFFAOYSA-N
Data  1 EC50
  Tab Delimited (TSV)   2D SDfile   Computed 3D by Vconf -m prep SDfile
Find this compound or compounds like it in BindingDB:
Activity Spreadsheet -- Enzyme Inhibition Constant Data from BindingDB
Found 1 hit for monomerid = 48972
TargetD(1B) dopamine receptor(Homo sapiens (Human))
Vanderbilt Screening Center For Gpcrs, Ion Channels And Transporters
Curated by PubChem BioAssay
LigandPNGBDBM48972(4-[7-[(2-fluorophenyl)methyl]-1,3-dimethyl-2,6-bis...)
Affinity DataEC50:  0.0341nM. Assay description: Assay Provider: Val Watts Assay Provider Affiliation: Purdue University Grant Title: Allosteric Modulators of D1 Receptors Grant Number: 1 X01 MH0776...
In DepthDetails PCBioAssay