BDBM49150 2-(5,6-Di-furan-2-yl-[1,2,4]triazin-3-ylsulfanyl)-N-(2,6-dimethyl-phenyl)-acetamide::2-[[5,6-bis(2-furanyl)-1,2,4-triazin-3-yl]thio]-N-(2,6-dimethylphenyl)acetamide::2-[[5,6-bis(2-furyl)-1,2,4-triazin-3-yl]thio]-N-(2,6-dimethylphenyl)acetamide::2-[[5,6-bis(furan-2-yl)-1,2,4-triazin-3-yl]sulfanyl]-N-(2,6-dimethylphenyl)acetamide::2-[[5,6-bis(furan-2-yl)-1,2,4-triazin-3-yl]sulfanyl]-N-(2,6-dimethylphenyl)ethanamide::MLS000556463::SMR000147780::cid_6402998
SMILES Cc1cccc(C)c1NC(=O)CSc1nnc(-c2ccco2)c(n1)-c1ccco1
InChI Key InChIKey=AJZYCLUWDCVNLC-UHFFFAOYSA-N
Data  3 IC50
  Tab Delimited (TSV)   2D SDfile   Computed 3D by Vconf -m prep SDfile
Find this compound or compounds like it in BindingDB:
Activity Spreadsheet -- Enzyme Inhibition Constant Data from BindingDB
Found 3 hits for monomerid = 49150
TargetInduced myeloid leukemia cell differentiation protein Mcl-1(Homo sapiens (Human))
Emory University
Curated by PubChem BioAssay
LigandPNGBDBM49150(2-(5,6-Di-furan-2-yl-[1,2,4]triazin-3-ylsulfanyl)-...)
Affinity DataIC50:  4.92E+3nM. Assay description: NIH Molecular Libraries Screening Centers Network [MLSCN] Emory Chemical Biology Discovery Center in MLSCN Assay provider: Nikolovska-Coleska, Univer...
In DepthDetails PCBioAssay
TargetM17 leucyl aminopeptidase(Plasmodium falciparum 3D7)
Srmlsc
Curated by PubChem BioAssay
LigandPNGBDBM49150(2-(5,6-Di-furan-2-yl-[1,2,4]triazin-3-ylsulfanyl)-...)
Affinity DataIC50:  1.89E+4nM. Assay description: Southern Research Molecular Libraries Screening Center (SRMLSC) Southern Research Institute (Birmingham, Alabama) NIH Molecular Libraries Screening...
In DepthDetails PCBioAssay
TargetEstrogen receptor beta(Homo sapiens (Human))
Emory University
Curated by PubChem BioAssay
LigandPNGBDBM49150(2-(5,6-Di-furan-2-yl-[1,2,4]triazin-3-ylsulfanyl)-...)
Affinity DataIC50:  2.00E+3nM. Assay description: NIH Molecular Libraries Screening Centers Network [MLSCN] Emory Chemical Biology Discovery Center in MLSCN Assay provider: John A. Katzenellenbogen, ...
In DepthDetails PCBioAssay