BDBM49256 4-tert-butyl-N-(2-methylsulfanylethyl)benzamide::4-tert-butyl-N-[2-(methylthio)ethyl]benzamide::MLS000062072::SMR000070346::cid_2191502
SMILES CSCCNC(=O)c1ccc(cc1)C(C)(C)C
InChI Key InChIKey=QQMCXARZBBCPRC-UHFFFAOYSA-N
Data  1 EC50
  Tab Delimited (TSV)   2D SDfile   Computed 3D by Vconf -m prep SDfile
Find this compound or compounds like it in BindingDB:
Activity Spreadsheet -- Enzyme Inhibition Constant Data from BindingDB
Found 1 hit for monomerid = 49256
TargetTranscription factor p65(Homo sapiens (Human))
Srmlsc
Curated by PubChem BioAssay
LigandPNGBDBM49256(4-tert-butyl-N-(2-methylsulfanylethyl)benzamide | ...)
Affinity DataEC50:  5.25E+3nM. Assay description: Southern Research Molecular Libraries Screening Center (SRMLSC) Southern Research Institute (Birmingham, Alabama) NIH Molecular Libraries Screening C...
In DepthDetails PCBioAssay