BDBM49279 5-chloro-2-(1-piperidinyl)-1H-benzimidazole::6-chloranyl-2-piperidin-1-yl-1H-benzimidazole::6-chloro-2-(1-piperidinyl)-1H-benzimidazole::6-chloro-2-piperidin-1-yl-1H-benzimidazole::6-chloro-2-piperidino-1H-benzimidazole::MLS000061657::SMR000069989::cid_771785
SMILES Clc1ccc2nc([nH]c2c1)N1CCCCC1
InChI Key InChIKey=CVLDPARFNKJSKT-UHFFFAOYSA-N
Data  1 EC50
  Tab Delimited (TSV)   2D SDfile   Computed 3D by Vconf -m prep SDfile
Find this compound or compounds like it in BindingDB:
Activity Spreadsheet -- Enzyme Inhibition Constant Data from BindingDB
Found 1 hit for monomerid = 49279
TargetTranscription factor p65(Homo sapiens (Human))
Srmlsc
Curated by PubChem BioAssay
LigandPNGBDBM49279(5-chloro-2-(1-piperidinyl)-1H-benzimidazole | 6-ch...)
Affinity DataEC50:  7.79E+3nM. Assay description: Southern Research Molecular Libraries Screening Center (SRMLSC) Southern Research Institute (Birmingham, Alabama) NIH Molecular Libraries Screening C...
In DepthDetails PCBioAssay