BDBM49309 (3-amino-5-methoxy-1-benzofuran-2-yl)-(4-methoxyphenyl)methanone::(3-amino-5-methoxy-2-benzofuranyl)-(4-methoxyphenyl)methanone::(3-amino-5-methoxy-benzofuran-2-yl)-(4-methoxyphenyl)methanone::(3-azanyl-5-methoxy-1-benzofuran-2-yl)-(4-methoxyphenyl)methanone::MLS000115319::SMR000092464::cid_1088163
SMILES COc1ccc(cc1)C(=O)c1oc2ccc(OC)cc2c1N
InChI Key InChIKey=SUVDQCRXQVEAAB-UHFFFAOYSA-N
Data  1 EC50
  Tab Delimited (TSV)   2D SDfile   Computed 3D by Vconf -m prep SDfile
Find this compound or compounds like it in BindingDB:
Activity Spreadsheet -- Enzyme Inhibition Constant Data from BindingDB
Found 1 hit for monomerid = 49309
TargetTranscription factor p65(Homo sapiens (Human))
Srmlsc
Curated by PubChem BioAssay
LigandPNGBDBM49309((3-amino-5-methoxy-1-benzofuran-2-yl)-(4-methoxyph...)
Affinity DataEC50:  3.69E+5nM. Assay description: Southern Research Molecular Libraries Screening Center (SRMLSC) Southern Research Institute (Birmingham, Alabama) NIH Molecular Libraries Screening C...
In DepthDetails PCBioAssay