BDBM49470 MLS000569762::N-(2,3-dimethylphenyl)-2-quinolinecarboxamide::N-(2,3-dimethylphenyl)quinaldamide::N-(2,3-dimethylphenyl)quinoline-2-carboxamide::SMR000155229::cid_2116521
SMILES Cc1cccc(NC(=O)c2ccc3ccccc3n2)c1C
InChI Key InChIKey=IBFFDAXZKQDQLD-UHFFFAOYSA-N
Data  2 EC50
  Tab Delimited (TSV)   2D SDfile   Computed 3D by Vconf -m prep SDfile
Find this compound or compounds like it in BindingDB:
Activity Spreadsheet -- Enzyme Inhibition Constant Data from BindingDB
Found 2 hits for monomerid = 49470
TargetOxysterols receptor LXR-beta(Homo sapiens (Human))
The Scripps Research Institute Molecular Screening Center
Curated by PubChem BioAssay
LigandPNGBDBM49470(MLS000569762 | N-(2,3-dimethylphenyl)-2-quinolinec...)
Affinity DataEC50:  6.75E+4nM. Assay description: Source (MLPCN Center Name): The Scripps Research Institute Molecular Screening Center Affiliation: UT Southwestern Assay Provider: David Mangelsdorf,...
In DepthDetails PCBioAssay
TargetTranscription factor p65(Homo sapiens (Human))
Srmlsc
Curated by PubChem BioAssay
LigandPNGBDBM49470(MLS000569762 | N-(2,3-dimethylphenyl)-2-quinolinec...)
Affinity DataEC50:  8.44E+4nM. Assay description: Southern Research Molecular Libraries Screening Center (SRMLSC) Southern Research Institute (Birmingham, Alabama) NIH Molecular Libraries Screening C...
In DepthDetails PCBioAssay