BDBM49478 (6Z)-3-methyl-6-(5-thiophen-2-yl-1,2-dihydropyrazol-3-ylidene)-1-cyclohexa-2,4-dienone::(6Z)-3-methyl-6-(5-thiophen-2-yl-1,2-dihydropyrazol-3-ylidene)cyclohexa-2,4-dien-1-one::(6Z)-3-methyl-6-[5-(2-thienyl)-3-pyrazolin-3-ylidene]cyclohexa-2,4-dien-1-one::MLS000568471::SMR000154620::cid_6708864
SMILES Cc1ccc(-c2cc([nH]n2)-c2cccs2)c(O)c1
InChI Key InChIKey=GJSKWHZFSLFJED-UHFFFAOYSA-N
Data  3 EC50
  Tab Delimited (TSV)   2D SDfile   Computed 3D by Vconf -m prep SDfile
Find this compound or compounds like it in BindingDB:
Activity Spreadsheet -- Enzyme Inhibition Constant Data from BindingDB
Found 3 hits for monomerid = 49478
TargetTranscription factor p65(Homo sapiens (Human))
Srmlsc
Curated by PubChem BioAssay
LigandPNGBDBM49478((6Z)-3-methyl-6-(5-thiophen-2-yl-1,2-dihydropyrazo...)
Affinity DataEC50:  1.31E+4nM. Assay description: Southern Research Molecular Libraries Screening Center (SRMLSC) Southern Research Institute (Birmingham, Alabama) NIH Molecular Libraries Screening C...
Ligand InfoPC cidPC sid
In DepthDetails PCBioAssay
TargetAryl hydrocarbon receptor(Homo sapiens (Human))
The Scripps Research Institute Molecular Screening Center
Curated by PubChem BioAssay
LigandPNGBDBM49478((6Z)-3-methyl-6-(5-thiophen-2-yl-1,2-dihydropyrazo...)
Affinity DataEC50:  1.21E+3nM. Assay description: Source (MLPCN Center Name): The Scripps Research Institute Molecular Screening Center (SRIMSC) Center Affiliation: The Scripps Research Institute (TS...
Ligand InfoPC cidPC sid
In DepthDetails PCBioAssay
TargetNuclear receptor subfamily 1 group I member 2(Homo sapiens (Human))
The Scripps Research Institute Molecular Screening Center
Curated by PubChem BioAssay
LigandPNGBDBM49478((6Z)-3-methyl-6-(5-thiophen-2-yl-1,2-dihydropyrazo...)
Affinity DataEC50: >1.16E+5nM. Assay description: Source (MLPCN Center Name): The Scripps Research Institute Molecular Screening Center (SRIMSC) Center Affiliation: The Scripps Research Institute (TS...
Ligand InfoPC cidPC sid
In DepthDetails PCBioAssay