BDBM50001275 CHEMBL280465
SMILES COc1cc2CCN(C(=O)Nc3cc(F)c(C)c(c3)-c3cccnc3)c2cc1C(F)(F)F
InChI Key InChIKey=WZBAGSREBJLWKO-UHFFFAOYSA-N
Data  3 KI
  Tab Delimited (TSV)   2D SDfile   Computed 3D by Vconf -m prep SDfile
Find this compound or compounds like it in BindingDB:
Activity Spreadsheet -- Enzyme Inhibition Constant Data from BindingDB
Found 3 hits for monomerid = 50001275
Target5-hydroxytryptamine receptor 2C(Homo sapiens (Human))
Smithkline Beecham Pharmaceuticals
Curated by ChEMBL
LigandPNGBDBM50001275(CHEMBL280465)
Affinity DataKi:  0.630nM. Assay description: Binding affinity towards human cloned 5-hydroxytryptamine receptor 2C in HEK293 cells, using [3H]mesulergine as radioligand.Checked by Author
In DepthDetails ArticlePubMed
Target5-hydroxytryptamine receptor 2B(Homo sapiens (Human))
Smithkline Beecham Pharmaceuticals
Curated by ChEMBL
LigandPNGBDBM50001275(CHEMBL280465)
Affinity DataKi:  7.90nM. Assay description: Binding affinities towards human cloned 5-hydroxytryptamine 2B receptor in HEK293 cells using [3H]5-HT as radioligand.Checked by Author
In DepthDetails ArticlePubMed
Target5-hydroxytryptamine receptor 2A(Homo sapiens (Human))
Smithkline Beecham Pharmaceuticals
Curated by ChEMBL
LigandPNGBDBM50001275(CHEMBL280465)
Affinity DataKi:  1.59E+3nM. Assay description: Binding affinity towards human cloned 5-hydroxytryptamine receptor 2A in HEK293 cells, using [3H]ketanserin as radioligand.Checked by Author
In DepthDetails ArticlePubMed