BDBM50004403 CHEMBL320685::{3-[2-(2-tert-Butoxycarbonylamino-3-phenyl-propionylamino)-3-(1H-imidazol-4-yl)-propionylamino]-4-cyclohexyl-2-hydroxy-butylsulfanyl}-acetic acid ethyl ester
SMILES CCOC(=O)CSC[C@H](O)[C@H](CC1CCCCC1)NC(=O)[C@H](Cc1cnc[nH]1)NC(=O)[C@H](Cc1ccccc1)NC(=O)OC(C)(C)C
InChI Key InChIKey=PNKQRYWWLVUNQN-DZUOILHNSA-N
Data  1 IC50
  Tab Delimited (TSV)   2D SDfile   Computed 3D by Vconf -m prep SDfile
Find this compound or compounds like it in BindingDB:
Activity Spreadsheet -- Enzyme Inhibition Constant Data from BindingDB
Found 1 hit for monomerid = 50004403
TargetRenin(Homo sapiens (Human))
Merck Research Laboratories
Curated by ChEMBL
LigandPNGBDBM50004403(CHEMBL320685 | {3-[2-(2-tert-Butoxycarbonylamino-3...)
Affinity DataIC50:  58nM. Assay description: Inhibition of human plasma renin
In DepthDetails ArticlePubMed