BDBM50005180 CHEMBL3093798
SMILES [Br-].[Br-].C(CCCCC[n+]1ccccc1)CCCCC[n+]1ccc2ccccc2c1
InChI Key InChIKey=ITQXBBQHVDNQGK-UHFFFAOYSA-L
Data  2 IC50
  Tab Delimited (TSV)   2D SDfile   Computed 3D by Vconf -m prep SDfile
Find this compound or compounds like it in BindingDB:
Activity Spreadsheet -- Enzyme Inhibition Constant Data from BindingDB
Found 2 hits for monomerid = 50005180
TargetAcetylcholinesterase(Homo sapiens (Human))
Charles University In Prague
Curated by ChEMBL
LigandPNGBDBM50005180(CHEMBL3093798)
Affinity DataIC50:  30nM. Assay description: Inhibition of human recombinant AChE after 5 mins by Ellman's method
In DepthDetails ArticlePubMed
TargetCholinesterase(Homo sapiens (Human))
Charles University In Prague
Curated by ChEMBL
LigandPNGBDBM50005180(CHEMBL3093798)
Affinity DataIC50:  700nM. Assay description: Inhibition of human plasmatic BChE after 5 mins by Ellman's method
In DepthDetails ArticlePubMed