BDBM50007195 CHEMBL3237866
SMILES [H][C@@]12C[C@@]([H])(C1(C)C)[C@]1(C)OB(O[C@]1([H])C2)[C@H](CC(C)C)NC(=O)[C@H](CCC(=O)NCCC(COCc1ccccc1)COCc1ccccc1)NC(C)=O
InChI Key InChIKey=CFHYMTUYGRCJAV-PTFKGFTKSA-N
Data  3 IC50
  Tab Delimited (TSV)   2D SDfile   Computed 3D by Vconf -m prep SDfile
Find this compound or compounds like it in BindingDB:
Activity Spreadsheet -- Enzyme Inhibition Constant Data from BindingDB
Found 3 hits for monomerid = 50007195
TargetProteasome subunit beta type-7(Homo sapiens (Human))
Hokkaido University
Curated by ChEMBL
LigandPNGBDBM50007195(CHEMBL3237866)
Affinity DataIC50:  76nM. Assay description: Inhibition of caspase-like activity of human 20S proteasome using Ac-nLPnLD-AMC as substrate
In DepthDetails ArticlePubMed
TargetProteasome subunit beta type-7(Homo sapiens (Human))
Hokkaido University
Curated by ChEMBL
LigandPNGBDBM50007195(CHEMBL3237866)
Affinity DataIC50:  5.70nM. Assay description: Inhibition of chymotrypsin-like activity of human 20S proteasome using Suc-LLVY-AMC as substrate
In DepthDetails ArticlePubMed
TargetProteasome subunit beta type-7(Homo sapiens (Human))
Hokkaido University
Curated by ChEMBL
LigandPNGBDBM50007195(CHEMBL3237866)
Affinity DataIC50:  2.50E+3nM. Assay description: Inhibition of trypsin-like activity of human 20S proteasome using Ac-RLR-AMC as substrate
In DepthDetails ArticlePubMed