BDBM50007198 CHEMBL3237862
SMILES [H][C@@]12C[C@@]([H])(C1(C)C)[C@]1(C)OB(O[C@]1([H])C2)[C@H](CC(C)C)NC(=O)[C@H](CC(=O)NCC(COCc1ccccc1)COCc1ccccc1)NC(C)=O
InChI Key InChIKey=GAOQGHGKECEBBK-VNRBZUKUSA-N
Data  3 IC50
  Tab Delimited (TSV)   2D SDfile   Computed 3D by Vconf -m prep SDfile
Find this compound or compounds like it in BindingDB:
Activity Spreadsheet -- Enzyme Inhibition Constant Data from BindingDB
Found 3 hits for monomerid = 50007198
TargetProteasome subunit beta type-7(Homo sapiens (Human))
Hokkaido University
Curated by ChEMBL
LigandPNGBDBM50007198(CHEMBL3237862)
Affinity DataIC50:  140nM. Assay description: Inhibition of caspase-like activity of human 20S proteasome using Ac-nLPnLD-AMC as substrate
In DepthDetails ArticlePubMed
TargetProteasome subunit beta type-7(Homo sapiens (Human))
Hokkaido University
Curated by ChEMBL
LigandPNGBDBM50007198(CHEMBL3237862)
Affinity DataIC50:  3.90nM. Assay description: Inhibition of chymotrypsin-like activity of human 20S proteasome using Suc-LLVY-AMC as substrate
In DepthDetails ArticlePubMed
TargetProteasome subunit beta type-7(Homo sapiens (Human))
Hokkaido University
Curated by ChEMBL
LigandPNGBDBM50007198(CHEMBL3237862)
Affinity DataIC50:  1.10E+3nM. Assay description: Inhibition of trypsin-like activity of human 20S proteasome using Ac-RLR-AMC as substrate
In DepthDetails ArticlePubMed