BDBM50010314 CHEMBL3251362
SMILES Nc1ncnc2n([C@@H]3O[C@H](COP(O)(=O)OP(O)(=O)OP(O)(O)=O)[C@@H](O)[C@H]3O)c(SCCCCO)nc12
InChI Key InChIKey=NVAIRALDUYDSJP-QYVSTXNMSA-N
Data  2 KI
  Tab Delimited (TSV)   2D SDfile   Computed 3D by Vconf -m prep SDfile
Find this compound or compounds like it in BindingDB:
Activity Spreadsheet -- Enzyme Inhibition Constant Data from BindingDB
Found 2 hits for monomerid = 50010314
TargetGTP:AMP phosphotransferase AK3, mitochondrial(Rattus norvegicus)
TBA
Curated by ChEMBL
LigandPNGBDBM50010314(CHEMBL3251362)
Affinity DataKi:  1.30E+5nM. Assay description: Competitive inhibition of Sprague-Dawley rat liver adenylate kinase 3 by Lineweaver-Burk plot analysis
In DepthDetails ArticlePubMed
TargetAdenylate kinase 2, mitochondrial(Rattus norvegicus)
TBA
Curated by ChEMBL
LigandPNGBDBM50010314(CHEMBL3251362)
Affinity DataKi:  1.45E+5nM. Assay description: Competitive inhibition of Sprague-Dawley rat liver adenylate kinase 2 by Lineweaver-Burk plot analysis
In DepthDetails ArticlePubMed