BDBM50013126 CHEMBL3261990
SMILES [Br-].[Br-].O\N=C\C(=O)Nc1ccc[n+](Cc2ccccc2C[n+]2cccc(NC(=O)\C=N\O)c2)c1
InChI Key InChIKey=XAUJZWNYMRNPHT-UHFFFAOYSA-N
Data  1 IC50  2 Kd
  Tab Delimited (TSV)   2D SDfile   Computed 3D by Vconf -m prep SDfile
Find this compound or compounds like it in BindingDB:
Activity Spreadsheet -- Enzyme Inhibition Constant Data from BindingDB
Found 3 hits for monomerid = 50013126
TargetAcetylcholinesterase(Homo sapiens (Human))
Defence Research & Development Establishment (Drde)
Curated by ChEMBL
LigandPNGBDBM50013126(CHEMBL3261990)
Affinity DataKd:  2.08E+4nM. Assay description: Binding affinity to sarin-inhibited hemoglobin free human erythrocyte ghost acetylcholinesterase using acetylthiocholineiodide as substrate measured ...
In DepthDetails ArticlePubMed
TargetAcetylcholinesterase(Homo sapiens (Human))
Defence Research & Development Establishment (Drde)
Curated by ChEMBL
LigandPNGBDBM50013126(CHEMBL3261990)
Affinity DataIC50:  1.70E+6nM. Assay description: Inhibition of hemoglobin free human erythrocyte ghost acetylcholinesterase using acetylthiocholineiodide as substrate measured up to 1 hr by Ellman m...
In DepthDetails ArticlePubMed
TargetAcetylcholinesterase(Homo sapiens (Human))
Defence Research & Development Establishment (Drde)
Curated by ChEMBL
LigandPNGBDBM50013126(CHEMBL3261990)
Affinity DataKd:  2.26E+4nM. Assay description: Binding affinity to VX-inhibited hemoglobin free human erythrocyte ghost acetylcholinesterase using acetylthiocholineiodide as substrate measured up ...
In DepthDetails ArticlePubMed