BDBM50014866 (-)-3-demethylcolchicine::3-Desmethylcolchicin::CHEMBL1081::N-(3-Hydroxy-1,2,10-trimethoxy-9-oxo-5,6,7,9-tetrahydro-benzo[a]heptalen-7-yl)-acetamide::cid_494161
SMILES COc1c(O)cc2CC[C@H](NC(C)=O)c3cc(=O)c(OC)ccc3-c2c1OC
InChI Key InChIKey=JRRUSQGIRBEMRN-HNNXBMFYSA-N
Data  3 IC50
  Tab Delimited (TSV)   2D SDfile   Computed 3D by Vconf -m prep SDfile
Find this compound or compounds like it in BindingDB:
Activity Spreadsheet -- Enzyme Inhibition Constant Data from BindingDB
Found 3 hits for monomerid = 50014866
TargetNuclear receptor subfamily 0 group B member 1(Homo sapiens (Human))
The Scripps Research Institute Molecular Screening Center
Curated by PubChem BioAssay
LigandPNGBDBM50014866((-)-3-demethylcolchicine | 3-Desmethylcolchicin | ...)
Affinity DataIC50: >6.74E+4nM
In DepthDetails PCBioAssay
TargetTubulin beta-2B chain(Bos taurus)
Niddk
Curated by ChEMBL
LigandPNGBDBM50014866((-)-3-demethylcolchicine | 3-Desmethylcolchicin | ...)
Affinity DataIC50:  2.90E+3nM. Assay description: Inhibitory effect on the polymerization of purified bovine brain tubulin.
In DepthDetails ArticlePubMed
TargetSteroidogenic factor 1(Homo sapiens (Human))
The Scripps Research Institute Molecular Screening Center
Curated by PubChem BioAssay
LigandPNGBDBM50014866((-)-3-demethylcolchicine | 3-Desmethylcolchicin | ...)
Affinity DataIC50: >6.74E+4nM
In DepthDetails PCBioAssay