BDBM50015662 3-Amino-N-{1-[5-[2-[2-(1-carboxy-2-phenyl-ethylcarbamoyl)-pyrrolidin-1-yl]-1-(3H-imidazol-4-ylmethyl)-2-oxo-ethylcarbamoyl]-8-(4-hydroxy-benzyl)-7,10-dioxo-1,2-dithia-6,9-diaza-cyclotridec-11-ylcarbamoyl]-4-guanidino-butyl}-succinamic acid::Asp-Arg-Hcy-Tyr--Hcy-His-Pro-Phe::CHEMBL411997::c(Hcy 3,5)Angiotensin II
SMILES N[C@@H](CC(O)=O)C(=O)N[C@@H](CCCNC(N)=N)C(=O)N[C@H]1CCSSCC[C@H](NC(=O)[C@H](Cc2ccc(O)cc2)NC1=O)C(=O)N[C@@H](Cc1cnc[nH]1)C(=O)N1CCC[C@H]1C(=O)N[C@@H](Cc1ccccc1)C(O)=O
InChI Key InChIKey=FULUKRVDSYUNQA-MDKUUQCZSA-N
Data  1 KI
  Tab Delimited (TSV)   2D SDfile   Computed 3D by Vconf -m prep SDfile
Find this compound or compounds like it in BindingDB:
Activity Spreadsheet -- Enzyme Inhibition Constant Data from BindingDB
Found 1 hit for monomerid = 50015662
TargetType-1 angiotensin II receptor B(RAT)
Uppsala University
Curated by ChEMBL
LigandPNGBDBM50015662(3-Amino-N-{1-[5-[2-[2-(1-carboxy-2-phenyl-ethylcar...)
Affinity DataKi:  0.230nM. Assay description: In vitro binding affinity at rat liver Angiotensin II receptor, type 1 was determined based on displacement of [125I]-Ang II
In DepthDetails ArticlePubMed