BDBM50017844 1-(3,4-Dihydroxy-5-nitro-phenyl)-ethanone::CHEMBL169033
SMILES CC(=O)c1cc(O)c(O)c(c1)[N+]([O-])=O
InChI Key InChIKey=RZTRFWLYXYIRAX-UHFFFAOYSA-N
Data  1 IC50
  Tab Delimited (TSV)   2D SDfile   Computed 3D by Vconf -m prep SDfile
Find this compound or compounds like it in BindingDB:
Activity Spreadsheet -- Enzyme Inhibition Constant Data from BindingDB
Found 1 hit for monomerid = 50017844
TargetCatechol O-methyltransferase(Rattus norvegicus (Rat))
Orion
Curated by ChEMBL
LigandPNGBDBM50017844(1-(3,4-Dihydroxy-5-nitro-phenyl)-ethanone | CHEMBL...)
Affinity DataIC50:  16nM. Assay description: In vitro inhibitory activity against catechol O-methyltransferase of rat brain using 3,4-dihydroxybenzoic acid as the substrate.
In DepthDetails ArticlePubMed