BDBM50017866 CHEMBL350927::N-Adamantan-1-yl-3,4-dihydroxy-5-nitro-benzamide
SMILES Oc1cc(cc(c1O)[N+]([O-])=O)C(=O)NC12CC3CC(CC(C3)C1)C2
InChI Key InChIKey=IALCRFZLEQENBW-UHFFFAOYSA-N
Data  1 IC50
  Tab Delimited (TSV)   2D SDfile   Computed 3D by Vconf -m prep SDfile
Find this compound or compounds like it in BindingDB:
Activity Spreadsheet -- Enzyme Inhibition Constant Data from BindingDB
Found 1 hit for monomerid = 50017866
TargetCatechol O-methyltransferase(Rattus norvegicus (Rat))
Orion
Curated by ChEMBL
LigandPNGBDBM50017866(CHEMBL350927 | N-Adamantan-1-yl-3,4-dihydroxy-5-ni...)
Affinity DataIC50:  19nM. Assay description: In vitro inhibitory activity against catechol O-methyltransferase of rat brain using 3,4-dihydroxybenzoic acid as the substrate.
In DepthDetails ArticlePubMed