BDBM50020283 CHEMBL3288832
SMILES COC(=O)[C@@H](Nc1c(C(=O)NCc2ccc(F)cc2F)c(=O)n(O)c2ncccc12)c1ccccc1
InChI Key InChIKey=CRXZLZPFZKAGOW-FQEVSTJZSA-N
Data  2 IC50
  Tab Delimited (TSV)   2D SDfile   Computed 3D by Vconf -m prep SDfile
Find this compound or compounds like it in BindingDB:
Activity Spreadsheet -- Enzyme Inhibition Constant Data from BindingDB
Found 2 hits for monomerid = 50020283
TargetIntegrase(Human immunodeficiency virus 1)
National Institutes Of Health
Curated by ChEMBL
LigandPNGBDBM50020283(CHEMBL3288832)
Affinity DataIC50:  10nM. Assay description: Inhibition of strand transfer activity of HIV-1 integrase using [gamma-32P]-labeled DNA as substrate
In DepthDetails ArticlePubMed
TargetIntegrase(Human immunodeficiency virus 1)
National Institutes Of Health
Curated by ChEMBL
LigandPNGBDBM50020283(CHEMBL3288832)
Affinity DataIC50:  1.67E+4nM. Assay description: Inhibition of 3'-processing activity of HIV-1 integrase using [gamma-32P]-labeled DNA as substrate
In DepthDetails ArticlePubMed