BDBM50020979 4-[4-(2,6-Dioxo-1,3-dipropyl-2,3,6,7-tetrahydro-1H-purin-8-yl)-benzenesulfonylamino]-butyric acid ethyl ester::CHEMBL11173
SMILES CCCn1c2nc([nH]c2c(=O)n(CCC)c1=O)-c1ccc(cc1)S(=O)(=O)NCCCC(=O)OCC
InChI Key InChIKey=BCNIMWNZIJLNRF-UHFFFAOYSA-N
Data  2 IC50
  Tab Delimited (TSV)   2D SDfile   Computed 3D by Vconf -m prep SDfile
Find this compound or compounds like it in BindingDB:
Activity Spreadsheet -- Enzyme Inhibition Constant Data from BindingDB
Found 2 hits for monomerid = 50020979
TargetAdenosine receptor A1(Rattus norvegicus (rat))
TBA
Curated by ChEMBL
LigandPNGBDBM50020979(4-[4-(2,6-Dioxo-1,3-dipropyl-2,3,6,7-tetrahydro-1H...)
Affinity DataIC50:  19nM. Assay description: Binding affinity against rat brain adenosine A1 receptor by using N6-[3H]- cyclohexyladenosine as radioligandChecked by Author
In DepthDetails ArticlePubMed
TargetAdenosine receptor A1(BOVINE)
TBA
Curated by ChEMBL
LigandPNGBDBM50020979(4-[4-(2,6-Dioxo-1,3-dipropyl-2,3,6,7-tetrahydro-1H...)
Affinity DataIC50:  0.240nM. Assay description: Binding affinity against bovine brain adenosine A1 receptor by using N6-[3H]- cyclohexyladenosineChecked by Author
In DepthDetails ArticlePubMed