BDBM50021694 CHEMBL3298661
SMILES CCN1\C(=C\C=C\C2=[N+](CCCCCC(=O)NCCCCNC(=O)C3(Cc4ccccc4C3)Nc3nc(NCCc4ccc(Cl)c(Cl)c4)nc(n3)N3CC4CC3CN4S(=O)(=O)c3cccc(c3)C(F)(F)F)c3ccc(cc3C2(C)C)S(O)(=O)=O)C(C)(C)c2cc(ccc12)S(O)(=O)=O
InChI Key InChIKey=BPSJWUVVHBNXSD-UHFFFAOYSA-O
Data  1 IC50
  Tab Delimited (TSV)   2D SDfile   Computed 3D by Vconf -m prep SDfile
Find this compound or compounds like it in BindingDB:
Activity Spreadsheet -- Enzyme Inhibition Constant Data from BindingDB
Found 1 hit for monomerid = 50021694
TargetIntegrin alpha-L(Homo sapiens (Human))
Glaxosmithkline
Curated by ChEMBL
LigandPNGBDBM50021694(CHEMBL3298661)
Affinity DataIC50:  28nM. Assay description: Antagonist activity at C-terminal 6xHis-tagged LFA-1 LBD (unknown origin) expressed in Escherichia coli assessed as inhibition of interaction with IC...
In DepthDetails ArticlePubMed