BDBM50021698 CHEMBL3298198
SMILES CCNC(=O)C1(Cc2ccccc2C1)Nc1nc(NCCc2ccc(Cl)c(Cl)c2)nc(n1)N1CC2CC1CN2S(=O)(=O)c1ccccc1OC(F)(F)F
InChI Key InChIKey=GEHBSLONJHNTNR-UHFFFAOYSA-N
Data  1 IC50
  Tab Delimited (TSV)   2D SDfile   Computed 3D by Vconf -m prep SDfile
Find this compound or compounds like it in BindingDB:
Activity Spreadsheet -- Enzyme Inhibition Constant Data from BindingDB
Found 1 hit for monomerid = 50021698
TargetIntegrin alpha-L(Homo sapiens (Human))
Glaxosmithkline
Curated by ChEMBL
LigandPNGBDBM50021698(CHEMBL3298198)
Affinity DataIC50:  22nM. Assay description: Antagonist activity at C-terminal 6xHis-tagged LFA-1 LBD (unknown origin) expressed in Escherichia coli assessed as inhibition of interaction with IC...
In DepthDetails ArticlePubMed