BDBM50027799 CHEMBL1908215::N-(2-Pnitrophenethyl) Dichloro Acetamide
SMILES [O-][N+](=O)c1ccc(CCNC(=O)C(Cl)Cl)cc1
InChI Key InChIKey=DUDPYHGWFFLHRW-UHFFFAOYSA-N
Data  1 KI
  Tab Delimited (TSV)   2D SDfile   Computed 3D by Vconf -m prep SDfile
Find this compound or compounds like it in BindingDB:
Activity Spreadsheet -- Enzyme Inhibition Constant Data from BindingDB
Found 1 hit for monomerid = 50027799
TargetCytochrome P450 1A1(Rattus norvegicus)
F. Hoffmann-La Roche
Curated by ChEMBL
LigandPNGBDBM50027799(CHEMBL1908215 | N-(2-Pnitrophenethyl) Dichloro Ace...)
Affinity DataKi:  2.70E+3nM. Assay description: Mechanism based inhibition of rat cytochrome P450 CYP1A1 measured by ethoxyresorufin O-deethylation warfarin R-6 and R-8 hydroxylation
In DepthDetails ArticlePubMed