BDBM50028548 1H-indole-5,6-diol::5,6-dihydroxyindole::CHEMBL92636::Dopamine lutine
SMILES Oc1cc2cc[nH]c2cc1O
InChI Key InChIKey=SGNZYJXNUURYCH-UHFFFAOYSA-N
Data  1 KI
PDB links: 2 PDB IDs match this monomer.
  Tab Delimited (TSV)   2D SDfile   Computed 3D by Vconf -m prep SDfile
Find this compound or compounds like it in BindingDB:
Activity Spreadsheet -- Enzyme Inhibition Constant Data from BindingDB
Found 1 hit for monomerid = 50028548
TargetCatechol O-methyltransferase(Rattus norvegicus (Rat))
TBA
Curated by ChEMBL
LigandPNGBDBM50028548(1H-indole-5,6-diol | 5,6-dihydroxyindole | CHEMBL9...)
Affinity DataKi:  3.46E+6nM. Assay description: Kinetic constants for the inactivation of Catechol O-methyltransferase by the compound
In DepthDetails ArticlePubMed