BDBM50030333 (3S,6S,7S)-3-(2-Methoxy-phenyl)-7-phenyl-1,8-diaza-spiro[5.5]undecane::CHEMBL332644
SMILES COc1ccccc1[C@@H]1CC[C@@]2(CCCN[C@H]2c2ccccc2)NC1
InChI Key InChIKey=BLYHUYRAYMAUST-BVYCBKJFSA-N
Data  1 KI  1 IC50
  Tab Delimited (TSV)   2D SDfile   Computed 3D by Vconf -m prep SDfile
Find this compound or compounds like it in BindingDB:
Activity Spreadsheet -- Enzyme Inhibition Constant Data from BindingDB
Found 2 hits for monomerid = 50030333
TargetSubstance-P receptor(Homo sapiens (Human))
Pfizer
Curated by ChEMBL
LigandPNGBDBM50030333((3S,6S,7S)-3-(2-Methoxy-phenyl)-7-phenyl-1,8-diaza...)
Affinity DataKi:  2nM. Assay description: In vitro binding affinity against substance P (NK-1) receptor in human IM-9 cell using [125I]-BH-SP
In DepthDetails ArticlePubMed
TargetSubstance-P receptor(Homo sapiens (Human))
Pfizer
Curated by ChEMBL
LigandPNGBDBM50030333((3S,6S,7S)-3-(2-Methoxy-phenyl)-7-phenyl-1,8-diaza...)
Affinity DataIC50:  2nM. Assay description: Binding affinity was measured against the Tachykinin receptor 1 in human IM-9 cells using [125I]Bolton-Hunter SP.
In DepthDetails ArticlePubMed