BDBM50037898 CHEMBL3358256
SMILES CN(C)CC(=O)NCC(Cc1ccc(cc1)-c1cccc(c1)C(F)(F)F)NC(=O)c1ccccc1OCc1ccccc1
InChI Key InChIKey=JNSRGEVQZRGFDS-UHFFFAOYSA-N
Data  1 IC50
  Tab Delimited (TSV)   2D SDfile   Computed 3D by Vconf -m prep SDfile
Find this compound or compounds like it in BindingDB:
Activity Spreadsheet -- Enzyme Inhibition Constant Data from BindingDB
Found 1 hit for monomerid = 50037898
TargetKinesin-like protein KIFC1(Homo sapiens (Human))
Astrazeneca
Curated by ChEMBL
LigandPNGBDBM50037898(CHEMBL3358256)
Affinity DataIC50: >1.00E+5nM. Assay description: Inhibition of recombinant N-terminal His6-tagged KIFC1 (Q305-K673 aa) (unknown origin) expressed in Escherichia coli BL21 (DE3) by malachite green as...
In DepthDetails ArticlePubMed