BDBM50038138 (6R,7R)-1-((4S,5R)-4-Acetoxy-5-methyl-3-methylene-6-phenyl-hexyl)-4,7-dihydroxy-6-(11-phenoxy-undecylcarbamoyloxy)-2,8-dioxa-bicyclo[3.2.1]octane-3,4,5-tricarboxylic acid::CHEMBL336939
SMILES C[C@H](Cc1ccccc1)[C@H](OC(C)=O)C(=C)CCC12OC([C@H](OC(=O)NCCCCCCCCCCCOc3ccccc3)[C@H]1O)(C(O)=O)C(O)(C(O2)C(O)=O)C(O)=O
InChI Key InChIKey=QOLHWXNSCZGWHK-BWBORTOCSA-N
Data  1 IC50
  Tab Delimited (TSV)   2D SDfile   Computed 3D by Vconf -m prep SDfile
Find this compound or compounds like it in BindingDB:
Activity Spreadsheet -- Enzyme Inhibition Constant Data from BindingDB
Found 1 hit for monomerid = 50038138
TargetSqualene synthase(Rattus norvegicus)
Merck Research Laboratories
Curated by ChEMBL
LigandPNGBDBM50038138((6R,7R)-1-((4S,5R)-4-Acetoxy-5-methyl-3-methylene-...)
Affinity DataIC50:  0.0700nM. Assay description: Tested for inhibition against squalene synthase enzyme in rat liver
In DepthDetails ArticlePubMed