BDBM50038677 (4-Bromo-benzyl)-[2-(5-methoxy-1H-indol-3-yl)-ethyl]-amine::CHEMBL57427
SMILES COc1ccc2[nH]cc(CCNCc3ccc(Br)cc3)c2c1
InChI Key InChIKey=XHLOUFPZLUULGI-UHFFFAOYSA-N
Data  3 KI
  Tab Delimited (TSV)   2D SDfile   Computed 3D by Vconf -m prep SDfile
Find this compound or compounds like it in BindingDB:
Activity Spreadsheet -- Enzyme Inhibition Constant Data from BindingDB
Found 3 hits for monomerid = 50038677
Target5-hydroxytryptamine receptor 2A(Homo sapiens (Human))
Virginia Commonwealth University
Curated by ChEMBL
LigandPNGBDBM50038677((4-Bromo-benzyl)-[2-(5-methoxy-1H-indol-3-yl)-ethy...)
Affinity DataKi:  0.100nM. Assay description: Affinity against 5-hydroxytryptamine 2A receptor (D) labeled with [125I]-DOI.
In DepthDetails ArticlePubMed
Target5-hydroxytryptamine receptor 2A(Homo sapiens (Human))
Virginia Commonwealth University
Curated by ChEMBL
LigandPNGBDBM50038677((4-Bromo-benzyl)-[2-(5-methoxy-1H-indol-3-yl)-ethy...)
Affinity DataKi:  5.20nM. Assay description: Affinity against 5-hydroxytryptamine 2A receptor (K) labeled with [3H]-ketanserin.
In DepthDetails ArticlePubMed
Target5-hydroxytryptamine receptor 2C(Rattus norvegicus (Rat))
Virginia Commonwealth University
Curated by ChEMBL
LigandPNGBDBM50038677((4-Bromo-benzyl)-[2-(5-methoxy-1H-indol-3-yl)-ethy...)
Affinity DataKi:  100nM. Assay description: Affinity against 5-hydroxytryptamine 2C receptor in J1 cells transfected with the rat 5-HT2C gene labeled with [3H]-mesulergine.
In DepthDetails ArticlePubMed