BDBM50038900 1-(7-Chloro-6-methyl-4-o-tolyl-quinolin-3-yl)-3-(2,4-difluoro-phenyl)-urea::CHEMBL63019
SMILES Cc1ccccc1-c1c(NC(=O)Nc2ccc(F)cc2F)cnc2cc(Cl)c(C)cc12
InChI Key InChIKey=TUEBOSIKZUMQNB-UHFFFAOYSA-N
Data  1 IC50
  Tab Delimited (TSV)   2D SDfile   Computed 3D by Vconf -m prep SDfile
Find this compound or compounds like it in BindingDB:
Activity Spreadsheet -- Enzyme Inhibition Constant Data from BindingDB
Found 1 hit for monomerid = 50038900
TargetSterol O-acyltransferase 1(Rattus norvegicus)
Takeda Chemical Industries
Curated by ChEMBL
LigandPNGBDBM50038900(1-(7-Chloro-6-methyl-4-o-tolyl-quinolin-3-yl)-3-(2...)
Affinity DataIC50:  9.30nM. Assay description: Inhibitory activity against acyl coenzyme A:cholesterol acyltransferase in rat microsomes
In DepthDetails ArticlePubMed