BDBM50048608 CHEMBL154488::Indol-1-yl-pyridin-4-yl-amine
SMILES N(c1ccncc1)n1ccc2ccccc12
InChI Key InChIKey=YFXZWVUZIPQSKX-UHFFFAOYSA-N
Data  6 IC50
  Tab Delimited (TSV)   2D SDfile   Computed 3D by Vconf -m prep SDfile
Find this compound or compounds like it in BindingDB:
Activity Spreadsheet -- Enzyme Inhibition Constant Data from BindingDB
Found 6 hits for monomerid = 50048608
TargetSodium-dependent noradrenaline transporter(Homo sapiens (Human))
Hoechst-Roussel Pharmaceuticals
Curated by ChEMBL
LigandPNGBDBM50048608(CHEMBL154488 | Indol-1-yl-pyridin-4-yl-amine)
Affinity DataIC50:  2.50E+3nM. Assay description: Inhibitory activity against norepinephrine (NE) uptake in rat whole brain synaptosome preparation
In DepthDetails ArticlePubMed
TargetAcetylcholinesterase(Rattus norvegicus (rat))
Hoechst-Roussel Pharmaceuticals
Curated by ChEMBL
LigandPNGBDBM50048608(CHEMBL154488 | Indol-1-yl-pyridin-4-yl-amine)
Affinity DataIC50: >1.00E+5nM. Assay description: Inhibitory activity against acetylcholinesterase in rat striatal preparation
In DepthDetails ArticlePubMed
TargetMuscarinic acetylcholine receptor M1/M2/M3/M4/M5(RAT)
Hoechst-Roussel Pharmaceuticals
Curated by ChEMBL
LigandPNGBDBM50048608(CHEMBL154488 | Indol-1-yl-pyridin-4-yl-amine)
Affinity DataIC50:  1.60E+4nM. Assay description: Inhibition of [3H]quinuclidinyl benzilate (QNB) binding from rat forebrain membranes in the presence of Zn
In DepthDetails ArticlePubMed
TargetAlpha-1A/Alpha-1B/Alpha-1D adrenergic receptor(Rattus norvegicus (rat))
Hoechst-Roussel Pharmaceuticals
Curated by ChEMBL
LigandPNGBDBM50048608(CHEMBL154488 | Indol-1-yl-pyridin-4-yl-amine)
Affinity DataIC50:  510nM. Assay description: Inhibitory activity against [3H]WB-4101 binding to Alpha-1 adrenergic receptor in rat whole brain membrane
In DepthDetails ArticlePubMed
LigandPNGBDBM50048608(CHEMBL154488 | Indol-1-yl-pyridin-4-yl-amine)
Affinity DataIC50:  8nM. Assay description: Inhibitory activity against [3H]clonidine binding to Alpha-2 adrenergic receptor in rat cortex
In DepthDetails ArticlePubMed
TargetMuscarinic acetylcholine receptor M1/M2/M3/M4/M5(RAT)
Hoechst-Roussel Pharmaceuticals
Curated by ChEMBL
LigandPNGBDBM50048608(CHEMBL154488 | Indol-1-yl-pyridin-4-yl-amine)
Affinity DataIC50:  4.00E+4nM. Assay description: Inhibition of [3H]quinuclidinyl benzilate (QNB) binding from rat forebrain membranes in the absence of Zn
In DepthDetails ArticlePubMed