BDBM50055827 (1H-Imidazol-2-yl)-(4-methoxy-2-methyl-phenyl)-amine::CHEMBL77913
SMILES COc1ccc(Nc2ncc[nH]2)c(C)c1
InChI Key InChIKey=BEAKKNUWBXQLLR-UHFFFAOYSA-N
Data  3 KI
  Tab Delimited (TSV)   2D SDfile   Computed 3D by Vconf -m prep SDfile
Find this compound or compounds like it in BindingDB:
Activity Spreadsheet -- Enzyme Inhibition Constant Data from BindingDB
Found 3 hits for monomerid = 50055827
TargetAlpha-2A adrenergic receptor(Homo sapiens (Human))
Allergan
Curated by ChEMBL
LigandPNGBDBM50055827((1H-Imidazol-2-yl)-(4-methoxy-2-methyl-phenyl)-ami...)
Affinity DataKi:  10nM. Assay description: Displacement of rauwolscine from human Alpha-2A adrenergic receptor expressed in CHO cells
In DepthDetails ArticlePubMed
TargetAlpha-2B adrenergic receptor(NEONATAL RAT)
Allergan
Curated by ChEMBL
LigandPNGBDBM50055827((1H-Imidazol-2-yl)-(4-methoxy-2-methyl-phenyl)-ami...)
Affinity DataKi:  434nM. Assay description: Displacement of rauwolscine from rat Alpha-2B adrenergic receptor expressed in CHO cells
In DepthDetails ArticlePubMed
TargetAlpha-2C adrenergic receptor(Homo sapiens (Human))
Allergan
Curated by ChEMBL
LigandPNGBDBM50055827((1H-Imidazol-2-yl)-(4-methoxy-2-methyl-phenyl)-ami...)
Affinity DataKi:  512nM. Assay description: Displacement of rauwolscine from human Alpha-2C adrenergic receptor expressed in CHO cells
In DepthDetails ArticlePubMed