BDBM50062442 9-Chloro-5-(4-chloro-phenyl)-2,2,4-trimethyl-2,5-dihydro-1H-6-oxa-1-aza-chrysene::CHEMBL322575
SMILES CC1=CC(C)(C)Nc2ccc3-c4cc(Cl)ccc4OC(c4ccc(Cl)cc4)c3c12
InChI Key InChIKey=YXPFGIHHVMUHLF-UHFFFAOYSA-N
Data  1 KI  1 EC50
  Tab Delimited (TSV)   2D SDfile   Computed 3D by Vconf -m prep SDfile
Find this compound or compounds like it in BindingDB:
Activity Spreadsheet -- Enzyme Inhibition Constant Data from BindingDB
Found 2 hits for monomerid = 50062442
TargetProgesterone receptor(Homo sapiens (Human))
Ligand Pharmaceuticals
Curated by ChEMBL
LigandPNGBDBM50062442(9-Chloro-5-(4-chloro-phenyl)-2,2,4-trimethyl-2,5-d...)
Affinity DataKi:  0.590nM. Assay description: The binding affinity measured using baculovirus-expressed hPR-A in sf21 cells.
In DepthDetails ArticlePubMed
TargetProgesterone receptor(Homo sapiens (Human))
Ligand Pharmaceuticals
Curated by ChEMBL
LigandPNGBDBM50062442(9-Chloro-5-(4-chloro-phenyl)-2,2,4-trimethyl-2,5-d...)
Affinity DataEC50:  9nM. Assay description: Agonistic activity was measured for modulation of hPR-B (human progesterone receptor) in co-transfected CV-1 cells.
In DepthDetails ArticlePubMed