BDBM50063761 CHEMBL3397478
SMILES COC(=O)CC1Oc2ccccc2-c2ccc3N(Cc4ccccc4)C(=O)C(=O)c3c12
InChI Key InChIKey=GQZBAPAYQNYGKJ-UHFFFAOYSA-N
Data  1 IC50
  Tab Delimited (TSV)   2D SDfile   Computed 3D by Vconf -m prep SDfile
Find this compound or compounds like it in BindingDB:
Activity Spreadsheet -- Enzyme Inhibition Constant Data from BindingDB
Found 1 hit for monomerid = 50063761
TargetOligo-1,6-glucosidase IMA1(Saccharomyces cerevisiae S288c (Baker's yeast))
Key Laboratory Of Industrial Fermentation Microbiology (Tianjin University Of Science And Technology)
Curated by ChEMBL
LigandPNGBDBM50063761(CHEMBL3397478)
Affinity DataIC50:  1.21E+4nM. Assay description: Inhibition of bakers yeast alpha-glucosidase using p-nitrophenyl-alpha-D-glucopyranoside as substrate after 30 mins by spectrophotometry
In DepthDetails ArticlePubMed