BDBM50064352 CHEMBL266912::N-Benzyl-2-{4-[2-(17-ethyl-1,14-dihydroxy-23,25-dimethoxy-13,19,21,27-tetramethyl-2,3,10,16-tetraoxo-11,28-dioxa-4-aza-tricyclo[22.3.1.0*4,9*]octacos-18-en-12-yl)-propenyl]-2-methoxy-cyclohexyloxy}-N-methyl-acetamide
SMILES CC[C@@H]1\C=C(C)\C[C@H](C)C[C@H](OC)[C@H]2O[C@](O)([C@H](C)C[C@@H]2OC)C(=O)C(=O)N2CCCC[C@H]2C(=O)O[C@@H]([C@H](C)[C@@H](O)CC1=O)C(\C)=C\C1CC[C@@H](OCC(=O)N(C)Cc2ccccc2)[C@@H](C1)OC
InChI Key InChIKey=MNEALIWQGDIOKR-HEXGZFPJSA-N
Data  1 IC50
  Tab Delimited (TSV)   2D SDfile   Computed 3D by Vconf -m prep SDfile
Find this compound or compounds like it in BindingDB:
Activity Spreadsheet -- Enzyme Inhibition Constant Data from BindingDB
Found 1 hit for monomerid = 50064352
TargetPeptidyl-prolyl cis-trans isomerase FKBP1A(Homo sapiens (Human))
Abbott Laboratories
Curated by ChEMBL
LigandPNGBDBM50064352(CHEMBL266912 | N-Benzyl-2-{4-[2-(17-ethyl-1,14-dih...)
Affinity DataIC50:  5.60nM. Assay description: Inhibitory binding activity against human Immunophilin-FK506 binding protein 12
In DepthDetails ArticlePubMed