BDBM50068219 CHEMBL3403319
SMILES NS(=O)(=O)c1ccc(NC(=O)c2ccc(F)cc2)cc1
InChI Key InChIKey=SWJJWJLTFFSLLV-UHFFFAOYSA-N
Data  1 KI  2 IC50
  Tab Delimited (TSV)   2D SDfile   Computed 3D by Vconf -m prep SDfile
Find this compound or compounds like it in BindingDB:
Activity Spreadsheet -- Enzyme Inhibition Constant Data from BindingDB
Found 3 hits for monomerid = 50068219
TargetAlkaline phosphatase, tissue-nonspecific isozyme(Bos taurus (Cattle))
Forman Christian College (A Chartered University)
Curated by ChEMBL
LigandPNGBDBM50068219(CHEMBL3403319)
Affinity DataKi:  2.51E+4nM. Assay description: Inhibition of bovine kidney non-specific alkaline phosphatase using CDP-star chemiluminescent substrate assessed as change in luminescence by spectro...
In DepthDetails ArticlePubMed
TargetIntestinal-type alkaline phosphatase(Bos taurus (Cattle))
Forman Christian College (A Chartered University)
Curated by ChEMBL
LigandPNGBDBM50068219(CHEMBL3403319)
Affinity DataIC50:  5.91E+3nM. Assay description: Inhibition of calf intestinal alkaline phosphatase using CDP-star chemiluminescent substrate assessed as change in luminescence by spectrophotometric...
In DepthDetails ArticlePubMed
TargetAlkaline phosphatase, tissue-nonspecific isozyme(Bos taurus (Cattle))
Forman Christian College (A Chartered University)
Curated by ChEMBL
LigandPNGBDBM50068219(CHEMBL3403319)
Affinity DataIC50:  5.86E+4nM. Assay description: Inhibition of bovine kidney non-specific alkaline phosphatase using CDP-star chemiluminescent substrate assessed as change in luminescence by spectro...
In DepthDetails ArticlePubMed