BDBM50068442 1,4-Bis-[2-(2-methoxy-phenyl)-ethyl]-piperazine::CHEMBL144393
SMILES COc1ccccc1CCN1CCN(CCc2ccccc2OC)CC1
InChI Key InChIKey=YHJWAFQSMFXGPG-UHFFFAOYSA-N
Data  6 KI
  Tab Delimited (TSV)   2D SDfile   Computed 3D by Vconf -m prep SDfile
Find this compound or compounds like it in BindingDB:
Activity Spreadsheet -- Enzyme Inhibition Constant Data from BindingDB
Found 6 hits for monomerid = 50068442
TargetSynaptic vesicular amine transporter(Rattus norvegicus (Rat))
University Of Kentucky
Curated by ChEMBL
LigandPNGBDBM50068442(1,4-Bis-[2-(2-methoxy-phenyl)-ethyl]-piperazine | ...)
Affinity DataKi:  35nM. Assay description: Inhibition of VMAT2 in rat striatal homogenate assessed as reduction in [3H]DA uptake after 8 mins by liquid scintillation spectrometric analysis
In DepthDetails ArticlePubMed
TargetSigma non-opioid intracellular receptor 1(Homo sapiens (Human))
National Institute Of Diabetes And Digestive And Kidney Diseases
Curated by ChEMBL
LigandPNGBDBM50068442(1,4-Bis-[2-(2-methoxy-phenyl)-ethyl]-piperazine | ...)
Affinity DataKi:  145nM. Assay description: Binding affinity was tested against sigma-1 receptor in guinea brain membranes.
In DepthDetails ArticlePubMed
TargetPotassium voltage-gated channel subfamily H member 2(Homo sapiens (Human))
University Of Kentucky
Curated by ChEMBL
LigandPNGBDBM50068442(1,4-Bis-[2-(2-methoxy-phenyl)-ethyl]-piperazine | ...)
Affinity DataKi:  1.02E+3nM. Assay description: Inhibition of [3H]dofetilide binding to human ERG expressed in HEK293 cell membranes after 60 mins by liquid scintillation spectrometric analysis
In DepthDetails ArticlePubMed
TargetSynaptic vesicular amine transporter(Rattus norvegicus (Rat))
University Of Kentucky
Curated by ChEMBL
LigandPNGBDBM50068442(1,4-Bis-[2-(2-methoxy-phenyl)-ethyl]-piperazine | ...)
Affinity DataKi:  1.17E+3nM. Assay description: Inhibition of [3H]DTBZ binding to VMAT2 in rat whole brain homogenate (excluding cerebellum) after 30 mins by liquid scintillation spectrometric anal...
In DepthDetails ArticlePubMed
TargetSodium-dependent serotonin transporter(Rattus norvegicus (rat))
University Of Kentucky
Curated by ChEMBL
LigandPNGBDBM50068442(1,4-Bis-[2-(2-methoxy-phenyl)-ethyl]-piperazine | ...)
Affinity DataKi:  1.58E+3nM. Assay description: Inhibition of SERT in rat striatal synaptosomes assessed as reduction in [3H]5-HT uptake preincubated for 5 mins followed by [3H]5-HT addition measur...
In DepthDetails ArticlePubMed
TargetSodium-dependent dopamine transporter(Rattus norvegicus (rat))
University Of Kentucky
Curated by ChEMBL
LigandPNGBDBM50068442(1,4-Bis-[2-(2-methoxy-phenyl)-ethyl]-piperazine | ...)
Affinity DataKi:  1.44E+4nM. Assay description: Inhibition of DAT in rat striatal synaptosomes assessed as reduction in [3H]DA uptake preincubated for 5 mins followed by [3H]DA addition measured af...
In DepthDetails ArticlePubMed