BDBM50070321 CHEMBL3408247::US9718800, 3.03b
SMILES C[C@@H](Nc1ccc(F)c(F)c1)c1cc(cc2c1oc(cc2=O)N1CCOCC1)C(=O)N(C)C
InChI Key InChIKey=UHDLRSYRMVRGIY-CQSZACIVSA-N
Data  6 IC50
  Tab Delimited (TSV)   2D SDfile   Computed 3D by Vconf -m prep SDfile
Find this compound or compounds like it in BindingDB:
Activity Spreadsheet -- Enzyme Inhibition Constant Data from BindingDB
Found 6 hits for monomerid = 50070321
LigandPNGBDBM50070321(CHEMBL3408247 | US9718800, 3.03b)
Affinity DataIC50:  2.50E+3nM. Assay description: Inhibition of human recombinant PI3Kgamma using PIP2 by Kinase-Glo Plus assay
In DepthDetails ArticlePubMed
LigandPNGBDBM50070321(CHEMBL3408247 | US9718800, 3.03b)
Affinity DataIC50:  32nM. Assay description: Inhibition of human recombinant PI3Kdelta using PIP2 by Kinase-Glo Plus assay
In DepthDetails ArticlePubMed
LigandPNGBDBM50070321(CHEMBL3408247 | US9718800, 3.03b)
Affinity DataIC50:  3nMT: 2°C. Assay description: Compounds in 100% DMSO were added to assay plates by acoustic dispensing. PI3Kβ was added in a Tris buffer (50 mM Tris pH7.4, 0.05% CHAPS, 2.1 m...
In DepthDetails US Patent
LigandPNGBDBM50070321(CHEMBL3408247 | US9718800, 3.03b)
Affinity DataIC50:  7nM. Assay description: Inhibition of human recombinant PI3Kbeta using PIP2 by Kinase-Glo Plus assay
In DepthDetails ArticlePubMed
LigandPNGBDBM50070321(CHEMBL3408247 | US9718800, 3.03b)
Affinity DataIC50:  170nM. Assay description: Inhibition of human recombinant PI3Kalpha using PIP2 by Kinase-Glo Plus assay
In DepthDetails ArticlePubMed
LigandPNGBDBM50070321(CHEMBL3408247 | US9718800, 3.03b)
Affinity DataIC50:  17nM. Assay description: Inhibition of PI3Kbeta in PTEN-null human MDA-MB-468 cells assessed as inhibition of Akt phosphorylation after 2 hrs
In DepthDetails ArticlePubMed