BDBM50070573 5-Chloro-6-ethylamino-N-(1-ethyl-4-methyl-[1,4]diazepan-6-yl)-2-methoxy-nicotinamide::CHEMBL38473
SMILES CCNc1nc(OC)c(cc1Cl)C(=O)NC1CN(C)CCN(CC)C1
InChI Key InChIKey=KCVFDLHNTSZQNS-UHFFFAOYSA-N
Data  4 IC50
  Tab Delimited (TSV)   2D SDfile   Computed 3D by Vconf -m prep SDfile
Find this compound or compounds like it in BindingDB:
Activity Spreadsheet -- Enzyme Inhibition Constant Data from BindingDB
Found 4 hits for monomerid = 50070573
TargetD(2) dopamine receptor(Rattus norvegicus (rat))
Dainippon Pharmaceutical
Curated by ChEMBL
LigandPNGBDBM50070573(5-Chloro-6-ethylamino-N-(1-ethyl-4-methyl-[1,4]dia...)
Affinity DataIC50:  76nM. Assay description: Inhibition of [3H]- spiperone binding to rat brain Dopamine receptor D2
In DepthDetails ArticlePubMed
Target5-hydroxytryptamine receptor 3A/3B(Rattus norvegicus)
Dainippon Pharmaceutical
Curated by ChEMBL
LigandPNGBDBM50070573(5-Chloro-6-ethylamino-N-(1-ethyl-4-methyl-[1,4]dia...)
Affinity DataIC50:  2nM. Assay description: Inhibition of [3H]- GR 65630 binding to rat cortical membrane 5-hydroxytryptamine 3 receptor
In DepthDetails ArticlePubMed
Target5-hydroxytryptamine receptor 3A/3B(Rattus norvegicus)
Dainippon Pharmaceutical
Curated by ChEMBL
LigandPNGBDBM50070573(5-Chloro-6-ethylamino-N-(1-ethyl-4-methyl-[1,4]dia...)
Affinity DataIC50:  1.96nM. Assay description: Concentration required to inhibit the binding of radioligand [3H]GR-65630 to serotonin 5-hydroxytryptamine-3 receptor (5-HT 3 receptor)in rat brain c...
In DepthDetails ArticlePubMed
TargetD(2) dopamine receptor(Rattus norvegicus (rat))
Dainippon Pharmaceutical
Curated by ChEMBL
LigandPNGBDBM50070573(5-Chloro-6-ethylamino-N-(1-ethyl-4-methyl-[1,4]dia...)
Affinity DataIC50:  76.4nM. Assay description: Inhibition of the binding of radioligand [3H]spiperone to dopamine receptor D2 in rat brain synaptic membrane
In DepthDetails ArticlePubMed