BDBM50071244 (2R,3R)-N*1*-Hydroxy-2-(3-hydroxy-propyl)-3-isobutyl-N*4*-[(S)-1-(2-methoxy-ethyl)-2-oxo-azepan-3-yl]-succinamide::CHEMBL66589
SMILES COCCN1CCCC[C@H](NC(=O)[C@H](CC(C)C)[C@@H](CCCO)C(=O)NO)C1=O
InChI Key InChIKey=JLEGVELHGVWFGG-ZACQAIPSSA-N
Data  2 IC50
PDB links: 1 PDB ID matches this monomer.
  Tab Delimited (TSV)   2D SDfile   Computed 3D by Vconf -m prep SDfile
Find this compound or compounds like it in BindingDB:
Activity Spreadsheet -- Enzyme Inhibition Constant Data from BindingDB
Found 2 hits for monomerid = 50071244
TargetInterstitial collagenase(Homo sapiens (Human))
Procter And Gamble Pharmaceuticals
Curated by ChEMBL
LigandPNGBDBM50071244((2R,3R)-N*1*-Hydroxy-2-(3-hydroxy-propyl)-3-isobut...)
Affinity DataIC50:  51nM. Assay description: Inhibition of matrix metalloproteinase-1 (MMP-1)
In DepthDetails ArticlePubMed
TargetStromelysin-1(Homo sapiens (Human))
Procter And Gamble Pharmaceuticals
Curated by ChEMBL
LigandPNGBDBM50071244((2R,3R)-N*1*-Hydroxy-2-(3-hydroxy-propyl)-3-isobut...)
Affinity DataIC50:  104nM. Assay description: Inhibition of matrix metalloproteinase-3 (MMP-3)
In DepthDetails ArticlePubMed