BDBM50072553 CHEMBL3409599
SMILES OCC(c1ccc(Cl)c(F)c1)n1ccc(cc1=O)-c1nc(NC2CCOCC2)ncc1Cl
InChI Key InChIKey=RTXTXTCXICRIOE-UHFFFAOYSA-N
Data  1 KI
  Tab Delimited (TSV)   2D SDfile   Computed 3D by Vconf -m prep SDfile
Find this compound or compounds like it in BindingDB:
Activity Spreadsheet -- Enzyme Inhibition Constant Data from BindingDB
Found 1 hit for monomerid = 50072553
TargetMitogen-activated protein kinase 1(Homo sapiens (Human))
Array Biopharma
Curated by ChEMBL
LigandPNGBDBM50072553(CHEMBL3409599)
Affinity DataKi:  0.200nM. Assay description: Inhibition of 6-His tagged human ERK2 expressed in Escherichia coli measured over 30 mins by competition assay
In DepthDetails ArticlePubMed