BDBM50072620 1-[4-Methoxy-3-(3,4,5-trihydroxy-6-hydroxymethyl-tetrahydro-pyran-2-yl)-phenyl]-cyclohexanecarboxylic acid::CHEMBL112796
SMILES COc1ccc(cc1C1OC(CO)C(O)C(O)C1O)C1(CCCCC1)C(O)=O
InChI Key InChIKey=JAEZFGMEYUZIIP-UHFFFAOYSA-N
Data  3 IC50
  Tab Delimited (TSV)   2D SDfile   Computed 3D by Vconf -m prep SDfile
Find this compound or compounds like it in BindingDB:
Activity Spreadsheet -- Enzyme Inhibition Constant Data from BindingDB
Found 3 hits for monomerid = 50072620
TargetP-selectin(Homo sapiens (Human))
Sankyo
Curated by ChEMBL
LigandPNGBDBM50072620(1-[4-Methoxy-3-(3,4,5-trihydroxy-6-hydroxymethyl-t...)
Affinity DataIC50:  3.00E+3nM. Assay description: Inhibitory activity of the compound against P-selectin IgG chimeras binding to sLex coating 96 wells using competitive cell-free ELISA assay was dete...
In DepthDetails ArticlePubMed
TargetE-selectin(Homo sapiens (Human))
Sankyo
Curated by ChEMBL
LigandPNGBDBM50072620(1-[4-Methoxy-3-(3,4,5-trihydroxy-6-hydroxymethyl-t...)
Affinity DataIC50: >1.00E+6nM. Assay description: Inhibitory activity of the compound against Selectin E IgG chimeras binding to sLex coating 96 wells using competitive cell-free ELISA assay was dete...
In DepthDetails ArticlePubMed
TargetL-selectin(Homo sapiens (Human))
Sankyo
Curated by ChEMBL
LigandPNGBDBM50072620(1-[4-Methoxy-3-(3,4,5-trihydroxy-6-hydroxymethyl-t...)
Affinity DataIC50:  1.00E+3nM. Assay description: Inhibitory activity of the compound against L-selectin IgG chimeras binding to sLex coating 96 wells using competitive cell-free ELISA assay was dete...
In DepthDetails ArticlePubMed